LISTSERV mailing list manager LISTSERV 16.5

Help for CSOUND-DEV Archives


CSOUND-DEV Archives

CSOUND-DEV Archives


March 2018


View:

Show Author | Hide Author
Show Table of Contents | Hide Table of Contents

 

Table of Contents:

Alogical problem (2 messages)
ANNOUNCEMENT: New York Csound Users Group meetings postponed (1 message)
AudioWorklet (3 messages)
Broken: csound/csound#3805 (develop - 89f6128) (1 message)
Broken: csound/csound#3872 (develop - e40c243) (1 message)
Broken: csound/csound#3873 (develop - 7d4fcf9) (1 message)
Build completed: csound 6.11.1508 (1 message)
Build completed: csound 6.11.1524 (1 message)
Build completed: csound 6.11.1532 (1 message)
Build completed: csound 6.11.1538 (1 message)
Build completed: csound 6.11.1542 (1 message)
Build completed: csound 6.11.1563 (1 message)
Build completed: csound 6.11.1566 (1 message)
Build failed (29 messages)
Build failed: csound 6.11.1527 (1 message)
Building WASM with INIT STATIC MODULES Option (2 messages)
Debian build problems again (7 messages)
empty score in current git terminates immediately (9 messages)
error message improvement (6 messages)
Errored: csound/csound#3832 (develop - 1f05e5a) (1 message)
Escape characters in scoreline strings (5 messages)
lenarray does not report correct array length for genarray (3 messages)
My talk at the Universidad Nacional de Quilmes in Buenos Aires (4 messages)
Noticed this in the release notes (1 message)
Passed: csound/csound#3833 (develop - 15a8cc4) (1 message)
Passed: csound/csound#3850 (feature/ableton_link_api_update - af25b60) (1 message)
Small oddity in manual (2 messages)
Warning: major change (3 messages)
[OT] in Rome (1 message)

LISTSERV Archives

LISTSERV Archives

CSOUND-DEV Home

CSOUND-DEV Home

Subject Sorted by Subject, Chronologically

From

Date

Size

New Thread

Alogical problem

Alogical problem

John

Sat, 10 Mar 2018 14:48:48 +0000

15 lines

Re: Alogical problem

Tarmo Johannes

Sat, 10 Mar 2018 17:32:24 +0200

28 lines

New Thread

ANNOUNCEMENT: New York Csound Users Group meetings postponed

ANNOUNCEMENT: New York Csound Users Group meetings postponed

Michael Gogins

Thu, 1 Mar 2018 06:44:59 -0300

45 lines

New Thread

AudioWorklet

AudioWorklet

Michael Gogins

Sat, 31 Mar 2018 10:24:39 +0000

36 lines

Re: AudioWorklet

Steven Yi

Sat, 31 Mar 2018 13:36:17 -0400

45 lines

Re: AudioWorklet

Michael Gogins

Sat, 31 Mar 2018 17:54:26 +0000

130 lines

New Thread

Broken: csound/csound#3805 (develop - 89f6128)

Broken: csound/csound#3805 (develop - 89f6128)

Travis CI

Fri, 2 Mar 2018 16:55:08 +0000

214 lines

New Thread

Broken: csound/csound#3872 (develop - e40c243)

Broken: csound/csound#3872 (develop - e40c243)

Travis CI

Thu, 29 Mar 2018 15:55:49 +0000

381 lines

New Thread

Broken: csound/csound#3873 (develop - 7d4fcf9)

Broken: csound/csound#3873 (develop - 7d4fcf9)

Travis CI

Thu, 29 Mar 2018 15:57:14 +0000

381 lines

New Thread

Build completed: csound 6.11.1508

Build completed: csound 6.11.1508

AppVeyor

Mon, 5 Mar 2018 16:09:06 +0000

23 lines

New Thread

Build completed: csound 6.11.1524

Build completed: csound 6.11.1524

AppVeyor

Sun, 11 Mar 2018 17:08:05 +0000

23 lines

New Thread

Build completed: csound 6.11.1532

Build completed: csound 6.11.1532

AppVeyor

Tue, 13 Mar 2018 21:55:39 +0000

23 lines

New Thread

Build completed: csound 6.11.1538

Build completed: csound 6.11.1538

AppVeyor

Thu, 15 Mar 2018 18:32:55 +0000

23 lines

New Thread

Build completed: csound 6.11.1542

Build completed: csound 6.11.1542

AppVeyor

Sun, 18 Mar 2018 14:27:55 +0000

23 lines

New Thread

Build completed: csound 6.11.1563

Build completed: csound 6.11.1563

AppVeyor

Thu, 29 Mar 2018 14:45:04 +0000

23 lines

New Thread

Build completed: csound 6.11.1566

Build completed: csound 6.11.1566

AppVeyor

Thu, 29 Mar 2018 17:12:37 +0000

23 lines

New Thread

Build failed

Build failed

AppVeyor

Thu, 1 Mar 2018 16:41:42 +0000

23 lines

Build failed

AppVeyor

Thu, 1 Mar 2018 21:59:32 +0000

23 lines

Build failed

AppVeyor

Fri, 2 Mar 2018 17:23:46 +0000

23 lines

Build failed

AppVeyor

Fri, 2 Mar 2018 17:56:50 +0000

23 lines

Build failed

AppVeyor

Fri, 2 Mar 2018 21:56:24 +0000

23 lines

Build failed

AppVeyor

Fri, 2 Mar 2018 22:29:23 +0000

23 lines

Build failed

AppVeyor

Fri, 2 Mar 2018 23:00:52 +0000

23 lines

Build failed

AppVeyor

Fri, 2 Mar 2018 23:32:41 +0000

23 lines

Build failed

AppVeyor

Sat, 3 Mar 2018 14:44:23 +0000

23 lines

Build failed

AppVeyor

Sat, 3 Mar 2018 15:13:32 +0000

23 lines

Build failed

AppVeyor

Sat, 3 Mar 2018 16:34:31 +0000

23 lines

Build failed

AppVeyor

Sat, 3 Mar 2018 21:03:04 +0000

23 lines

Build failed

AppVeyor

Sun, 4 Mar 2018 15:50:11 +0000

23 lines

Build failed

AppVeyor

Sun, 4 Mar 2018 22:02:53 +0000

23 lines

Build failed

AppVeyor

Sun, 11 Mar 2018 15:20:09 +0000

23 lines

Build failed

AppVeyor

Mon, 12 Mar 2018 23:03:07 +0000

23 lines

Build failed

AppVeyor

Tue, 13 Mar 2018 19:51:08 +0000

23 lines

Re: Build failed

Victor Lazzarini

Tue, 13 Mar 2018 19:56:20 +0000

29 lines

Build failed

AppVeyor

Tue, 13 Mar 2018 19:58:45 +0000

23 lines

Build failed

AppVeyor

Tue, 13 Mar 2018 21:19:51 +0000

23 lines

Build failed

AppVeyor

Thu, 15 Mar 2018 13:15:26 +0000

23 lines

Build failed

AppVeyor

Thu, 15 Mar 2018 15:07:44 +0000

23 lines

Build failed

AppVeyor

Thu, 15 Mar 2018 16:19:34 +0000

23 lines

Build failed

AppVeyor

Sat, 17 Mar 2018 15:34:36 +0000

23 lines

Build failed

AppVeyor

Wed, 28 Mar 2018 10:34:52 +0000

23 lines

Re: Build failed

John ff

Wed, 28 Mar 2018 12:26:34 +0100

73 lines

Re: Build failed

Victor Lazzarini

Wed, 28 Mar 2018 15:44:26 +0000

33 lines

Build failed

AppVeyor

Thu, 29 Mar 2018 16:18:10 +0000

23 lines

Build failed

AppVeyor

Thu, 29 Mar 2018 16:43:17 +0000

23 lines

New Thread

Build failed: csound 6.11.1527

Build failed: csound 6.11.1527

AppVeyor

Mon, 12 Mar 2018 21:46:18 +0000

23 lines

New Thread

Building WASM with INIT STATIC MODULES Option

Building WASM with INIT STATIC MODULES Option

Edward Costello

Thu, 8 Mar 2018 15:59:42 +0000

23 lines

Re: Building WASM with INIT STATIC MODULES Option

Edward Costello

Thu, 8 Mar 2018 16:23:09 +0000

31 lines

New Thread

Debian build problems again

Debian build problems again

Dave Seidel

Fri, 23 Mar 2018 08:10:04 -0400

69 lines

Re: Debian build problems again

Victor Lazzarini

Fri, 23 Mar 2018 12:13:26 +0000

49 lines

Re: Debian build problems again

Dave Seidel

Fri, 23 Mar 2018 08:22:13 -0400

134 lines

Re: Debian build problems again

Steven Yi

Fri, 23 Mar 2018 08:31:25 -0400

89 lines

Re: Debian build problems again

John ff

Fri, 23 Mar 2018 12:35:14 +0000

106 lines

Re: Debian build problems again

Dave Seidel

Fri, 23 Mar 2018 08:53:19 -0400

172 lines

Re: Debian build problems again

Dave Seidel

Fri, 23 Mar 2018 08:54:29 -0400

207 lines

New Thread

empty score in current git terminates immediately

empty score in current git terminates immediately

joachim heintz

Sat, 10 Mar 2018 22:40:04 +0100

19 lines

Re: empty score in current git terminates immediately

joachim heintz

Sat, 10 Mar 2018 22:42:19 +0100

30 lines

Re: empty score in current git terminates immediately

jpff

Sat, 10 Mar 2018 21:44:51 +0000

32 lines

Re: empty score in current git terminates immediately

jpff

Sat, 10 Mar 2018 23:27:29 +0000

45 lines

Re: empty score in current git terminates immediately

=?UTF-8?Q?Bernt_Isak_W=C3=A6rstad?=

Sun, 11 Mar 2018 11:43:39 +0100

107 lines

Re: empty score in current git terminates immediately

Victor Lazzarini

Sun, 11 Mar 2018 11:15:17 +0000

78 lines

Re: empty score in current git terminates immediately

jpff

Sun, 11 Mar 2018 14:21:38 +0000

50 lines

Re: empty score in current git terminates immediately

joachim heintz

Sun, 11 Mar 2018 17:15:52 +0100

48 lines

Re: empty score in current git terminates immediately

jpff

Sun, 11 Mar 2018 16:45:21 +0000

61 lines

New Thread

error message improvement

error message improvement

joachim heintz

Sat, 10 Mar 2018 09:31:31 +0100

22 lines

Re: error message improvement

John ff

Sat, 10 Mar 2018 13:09:50 +0000

35 lines

Re: error message improvement

jpff

Sat, 10 Mar 2018 13:29:19 +0000

32 lines

Re: error message improvement

jpff

Sat, 10 Mar 2018 13:49:16 +0000

30 lines

Re: error message improvement

jpff

Sat, 10 Mar 2018 16:03:14 +0000

13 lines

Re: error message improvement

joachim heintz

Sat, 10 Mar 2018 21:19:19 +0100

30 lines

New Thread

Errored: csound/csound#3832 (develop - 1f05e5a)

Errored: csound/csound#3832 (develop - 1f05e5a)

Travis CI

Sun, 11 Mar 2018 14:36:43 +0000

263 lines

New Thread

Escape characters in scoreline strings

Escape characters in scoreline strings

=?UTF-8?B?SGzDtsOwdmVyIFNpZ3Vyw7Bzc29u?=

Tue, 6 Mar 2018 11:10:06 +0100

54 lines

Re: Escape characters in scoreline strings

John ff

Tue, 6 Mar 2018 11:56:20 +0000

53 lines

Re: Escape characters in scoreline strings

jpff

Tue, 6 Mar 2018 14:52:06 +0000

51 lines

Re: Escape characters in scoreline strings

jpff

Tue, 6 Mar 2018 15:20:33 +0000

48 lines

Re: Escape characters in scoreline strings

=?UTF-8?B?SGzDtsOwdmVyIFNpZ3Vyw7Bzc29u?=

Tue, 6 Mar 2018 16:35:51 +0100

98 lines

New Thread

lenarray does not report correct array length for genarray

lenarray does not report correct array length for genarray

joachim heintz

Fri, 23 Mar 2018 09:34:42 +0100

29 lines

Re: lenarray does not report correct array length for genarray

Victor Lazzarini

Fri, 23 Mar 2018 08:46:30 +0000

41 lines

Re: lenarray does not report correct array length for genarray

joachim heintz

Fri, 23 Mar 2018 10:21:37 +0100

51 lines

New Thread

My talk at the Universidad Nacional de Quilmes in Buenos Aires

My talk at the Universidad Nacional de Quilmes in Buenos Aires

Michael Gogins

Thu, 29 Mar 2018 13:33:23 -0300

26 lines

Re: My talk at the Universidad Nacional de Quilmes in Buenos Aires

Arthur Hunkins

Thu, 29 Mar 2018 13:07:07 -0400

75 lines

Re: My talk at the Universidad Nacional de Quilmes in Buenos Aires

Michael Gogins

Thu, 29 Mar 2018 14:36:18 -0300

48 lines

Re: My talk at the Universidad Nacional de Quilmes in Buenos Aires

Dr. Richard Boulanger

Fri, 30 Mar 2018 02:50:12 -0400

131 lines

New Thread

Noticed this in the release notes

Noticed this in the release notes

Michael Gogins

Tue, 13 Mar 2018 14:12:29 -0300

21 lines

New Thread

Passed: csound/csound#3833 (develop - 15a8cc4)

Passed: csound/csound#3833 (develop - 15a8cc4)

Travis CI

Sun, 11 Mar 2018 16:48:52 +0000

264 lines

New Thread

Passed: csound/csound#3850 (feature/ableton_link_api_update - af25b60)

Passed: csound/csound#3850 (feature/ableton_link_api_update - af25b60)

Travis CI

Sun, 18 Mar 2018 13:57:59 +0000

266 lines

New Thread

Small oddity in manual

Small oddity in manual

John

Sun, 11 Mar 2018 17:40:05 +0000

11 lines

Re: Small oddity in manual

Francois PINOT

Tue, 13 Mar 2018 12:04:03 +0100

47 lines

New Thread

Warning: major change

Re: Warning: major change

Michael Gogins

Sat, 17 Mar 2018 08:10:48 -0300

34 lines

Re: Warning: major change

Michael Gogins

Sat, 17 Mar 2018 08:14:34 -0300

46 lines

Re: Warning: major change

Victor Lazzarini

Sat, 17 Mar 2018 11:27:40 +0000

58 lines

New Thread

[OT] in Rome

[OT] in Rome

luis jure

Fri, 9 Mar 2018 23:12:27 +0100

21 lines

Advanced Options


Options

Log In

Log In

Get Password

Get Password


Search Archives

Search Archives


Subscribe or Unsubscribe

Subscribe or Unsubscribe


Archives

December 2018
November 2018
October 2018
September 2018
August 2018
July 2018
June 2018
May 2018
April 2018
March 2018
February 2018
January 2018
December 2017
November 2017
October 2017
September 2017
August 2017
July 2017
June 2017
May 2017
April 2017
March 2017
February 2017
January 2017
December 2016
November 2016
October 2016
September 2016
August 2016
July 2016
June 2016
May 2016
April 2016
March 2016
February 2016
January 2016
December 2015
November 2015
October 2015

ATOM RSS1 RSS2



LISTSERV.HEANET.IE

Secured by F-Secure Anti-Virus CataList Email List Search Powered by the LISTSERV Email List Manager